Target
Ribosomal protein S6 kinase alpha-2
Ligand
BDBM184275
Substrate
Meas. Tech.
Kinase Glo Plus Assay
pH
7.5±n/a
IC50
140±n/a nM
Comments
extracted
Citation
 Boyer, SJGao, DAGuo, XKirrane, Jr., TMSarko, CRSnow, RJSoleymanzadeh, FZhang, Y Heterocyclic compounds containing an indole core US Patent  US9150577 Publication Date 10/6/2015 
Target
Name:
Ribosomal protein S6 kinase alpha-2
Synonyms:
90 kDa ribosomal protein S6 kinase 2 KS6A2_HUMAN MAPKAPK1C RPS6KA2(Kin.Dom.1 - N-terminal) Ribosomal S6 Kinase 3 (RSK-3) Ribosomal protein S6 kinase alpha 2 (RSK2) p90-RSK 2 pp90RSK3
Type:
Serine/threonine-protein kinase
Mol. Mass.:
83259.46
Organism:
Homo sapiens (Human)
Description:
Residue:
733
  
Inhibitor
Name:
BDBM184275
Synonyms:
US9150577, 145
Type:
Small organic molecule
Emp. Form.:
C22H23N3O2
Mol. Mass.:
361.4369
SMILES:
CC(C)c1cccc(NC(=O)c2ccc3cc4C(=O)NCCCn4c3c2)c1
: