Target
Ferrochelatase, mitochondrial [R115L]
Ligand
BDBM185151
Substrate
Meas. Tech.
Competition Binding Assays
Kd
4.5e+3±n/a nM
Citation
 Klaeger, SGohlke, BPerrin, JGupta, VHeinzlmeir, SHelm, DQiao, HBergamini, GHanda, HSavitski, MMBantscheff, MMédard, GPreissner, RKuster, B Chemical Proteomics Reveals Ferrochelatase as a Common Off-target of Kinase Inhibitors. ACS Chem Biol 11:1245-54 (2016)  
Target
Name:
Ferrochelatase, mitochondrial [R115L]
Synonyms:
FECH HEMH_HUMAN
Type:
Protein
Mol. Mass.:
47832.73
Organism:
Homo sapiens (Human)
Description:
Mutant R115L used for experiment
Residue:
423
  
Inhibitor
Name:
BDBM185151
Synonyms:
4-[(5Z)-4-amino-5-(7-methoxyindol-2-ylidene)-1H-imidazo[5,1-f][1,2,4]triazin-7-yl]cyclohexane-1-carboxylic acid | OSI-027
Type:
Small organic molecule
Emp. Form.:
C21H22N6O3
Mol. Mass.:
406.4378
SMILES:
COc1cccc2=C\C(N=c12)=c1\nc(C2CCC(CC2)C(O)=O)n2NC=NC(N)=c12
: