Target
Leucine-rich repeat serine/threonine-protein kinase 2
Ligand
BDBM50059301
Substrate
Meas. Tech.
Lantha Screen Technology Assay
pH
7.5±n/a
IC50
5±n/a nM
Comments
extracted
Citation
 Galatsis, PHayward, MMKormos, BLWager, TTZhang, LStepan, AFHenderson, JLKurumbail, RGVerhoest, PR 4-(substituted amino)-7H-pyrrolo[2,3-d] pyrimidines as LRRK2 inhibitors US Patent  US9156845 Publication Date 10/13/2015 
Target
Name:
Leucine-rich repeat serine/threonine-protein kinase 2
Synonyms:
Dardarin LRRK2_HUMAN Leucine-rich repeat serine/threonine-protein kinase 2 PARK8
Type:
Protein
Mol. Mass.:
286113.20
Organism:
Homo sapiens (Human)
Description:
Q5S007
Residue:
2527
  
Inhibitor
Name:
BDBM50059301
Synonyms:
CHEMBL3393346 | US9156845, 5
Type:
Small organic molecule
Emp. Form.:
C15H13N5
Mol. Mass.:
263.2972
SMILES:
CN(C)c1ncnc2[nH]cc(-c3cccc(c3)C#N)c12
: