Target
Bcl-2-like protein 1
Ligand
BDBM185628
Substrate
Meas. Tech.
Time Resolved-Fluorescence Resonance Energy Transfer (TR-FRET) Assay
Temperature
298.15±n/a K
Ki
0.053±n/a nM
Comments
extracted
Citation
 Kunzer, ARElmore, SWHexamer, LAPark, CSouers, AJSullivan, GMWang, GTWang, XWendt, MD Apoptosis-inducing agents for the treatment of cancer and immune and autoimmune diseases US Patent  US9156856 Publication Date 10/13/2015 
Target
Name:
Bcl-2-like protein 1
Synonyms:
Anti-apoptotic Bcl-2 protein Apoptosis regulator Bcl-X BCL2-like 1 isoform 1 BCL2L1 Bcl-2-like protein 1 (Bcl-XL) Bcl-xL/Bcl-2-binding component 3 Bcl2-antagonist of cell death (BAD)
Type:
Mitochondrion membrane; Single-pass membrane protein
Mol. Mass.:
26039.60
Organism:
Homo sapiens (Human)
Description:
Residue:
233
  
Inhibitor
Name:
BDBM185628
Synonyms:
US9156856, 41 | US9493431, 41
Type:
Small organic molecule
Emp. Form.:
C41H42ClFN8O4S
Mol. Mass.:
797.34
SMILES:
Cc1cc(C)n2nc(nc2n1)S(=O)(=O)NC(=O)c1ccc(cc1Oc1cc2cc[nH]c2cc1F)N1CCN(CC2=C(CC(C)(C)CC2)c2ccc(Cl)cc2)CC1
: