Target
Histamine oxidase
Ligand
BDBM185656
Substrate
Meas. Tech.
Inhibition Assay
pH
7.2±n/a
Temperature
303.15±n/a K
IC50
250000±n/a nM
Comments
extracted
Citation
 Sayre, LM Amine oxidase inhibitors US Patent  US9161922 Publication Date 10/20/2015 
Target
Name:
Histamine oxidase
Synonyms:
AMOH_ARTGO | Amine oxidase (AGAO)
Type:
Enzyme
Mol. Mass.:
75087.19
Organism:
Arthrobacter globiformis
Description:
Q59118
Residue:
684
  
Inhibitor
Name:
BDBM185656
Synonyms:
US9161922, Table 3, Compound 1
Type:
Small organic molecule
Emp. Form.:
C14H19N3O
Mol. Mass.:
245.3202
SMILES:
NCC#CCC(N)C(=O)NCCc1ccccc1
: