Target
D(2) dopamine receptor
Ligand
BDBM185680
Substrate
Meas. Tech.
Beta-Arrestin Recruitment (Tango) Assay
pH
7.4±n/a
EC50
2.5±n/a nM
Comments
extracted
Citation
 Jin, JRoth, BFrye, S Functionally selective ligands of dopamine D2 receptors US Patent  US9156822 Publication Date 10/13/2015 
Target
Name:
D(2) dopamine receptor
Synonyms:
D(2) dopamine receptor DOPAMINE D2 Long DRD2 Dopamine D2 receptor Dopamine D2 receptor (D2R) Dopamine2-like | d2
Type:
Cell-surface receptors
Mol. Mass.:
50647.10
Organism:
Homo sapiens (Human)
Description:
P14416
Residue:
443
  
Inhibitor
Name:
BDBM185680
Synonyms:
UNC10107954 | US9156822, 10
Type:
Small organic molecule
Emp. Form.:
C25H31N3O3
Mol. Mass.:
421.5319
SMILES:
COc1ccccc1N1CCCN(CCCCOc2ccc3ccc(=O)[nH]c3c2)CC1
: