Target
Tyrosine-protein kinase JAK2
Ligand
BDBM185700
Substrate
Meas. Tech.
Enzymatic Assay
pH
7.4±n/a
IC50
17.5±n/a nM
Comments
extracted
Citation
 Mitton-Fry, MJBerlinski, PJBirchmeier, MJBowman, JWGonzales, AJKamerling, SGMann, DW Pyrrolo[2,3-d]pyrimidine compounds US Patent  US9161939 Publication Date 10/20/2015 
Target
Name:
Tyrosine-protein kinase JAK2
Synonyms:
JAK-2 JAK2_HUMAN Janus kinase 2 (JAK2) | Janus kinase 2 (a protein tyrosine kinase)
Type:
Protein
Mol. Mass.:
130684.68
Organism:
Homo sapiens (Human)
Description:
O60674
Residue:
1132
  
Inhibitor
Name:
BDBM185700
Synonyms:
US10875847, Compound Oclacitinib US9271981, 1a
Type:
Small organic molecule
Emp. Form.:
C15H23N5O2S
Mol. Mass.:
337.44
SMILES:
CNS(=O)(=O)C[C@H]1CC[C@@H](CC1)N(C)c1ncnc2[nH]ccc12
: