Target
Poly [ADP-ribose] polymerase tankyrase-2
Ligand
BDBM185816
Substrate
Meas. Tech.
Biochemical Assay
Temperature
298.15±n/a K
IC50
7±1 nM
Comments
extracted
Citation
 Chen, CHChin, DNDiPietro, LVFan, JPalermo, MGShultz, MDToure, B 4-piperidinyl compounds for use as tankyrase inhibitors US Patent  US9163003 Publication Date 10/20/2015 
Target
Name:
Poly [ADP-ribose] polymerase tankyrase-2
Synonyms:
(ARTD6 or PARP5b) Poly [ADP-ribose] polymerase tankyrase-2 TNKL TNKS2_HUMAN Tankyrase 2 Tankyrase-2 Tankyrase-2 (TNKS2)
Type:
Enzyme
Mol. Mass.:
126937.16
Organism:
Homo sapiens (Human)
Description:
Q9H2K2
Residue:
1166
  
Inhibitor
Name:
BDBM185816
Synonyms:
US9163003, 28 | USRE46942, Example 28
Type:
Small organic molecule
Emp. Form.:
C27H30N4O4
Mol. Mass.:
474.5515
SMILES:
COc1ccc(cc1C)C(=O)C1CCN(CC1)[C@H]1CCN(Cc2nc3ccccc(=O)c3[nH]2)C1=O
: