Target
Poly [ADP-ribose] polymerase 2
Ligand
BDBM185801
Substrate
Meas. Tech.
Biochemical Assay
Temperature
298.15±n/a K
IC50
4620±950 nM
Comments
extracted
Citation
 Chen, CHChin, DNDiPietro, LVFan, JPalermo, MGShultz, MDToure, B 4-piperidinyl compounds for use as tankyrase inhibitors US Patent  US9163003 Publication Date 10/20/2015 
Target
Name:
Poly [ADP-ribose] polymerase 2
Synonyms:
(ARTD2 or PARP2) ADPRTL2 PARP2_HUMAN Poly [ADP-ribose] polymerase 2 (PARP2)
Type:
Enzyme
Mol. Mass.:
66225.70
Organism:
Homo sapiens (Human)
Description:
Q9UGN5
Residue:
583
  
Inhibitor
Name:
BDBM185801
Synonyms:
US9163003, 9 | USRE46942, Example 9
Type:
Small organic molecule
Emp. Form.:
C24H27ClN4O4
Mol. Mass.:
470.949
SMILES:
Clc1ccc(cc1)C(=O)C1CCN(CC1)C1CCN(Cc2nc3CCOCc3c(=O)[nH]2)C1=O
: