Target
Amyloid-beta precursor protein
Ligand
BDBM186067
Substrate
Meas. Tech.
Inhibition Assay
IC50
81±n/a nM
Citation
 Lueoend, RMMachauer, RRueeger, HVeenstra, SJ Oxazine derivatives and their use in the treatment of disease US Patent  US9163011 Publication Date 10/20/2015 
Target
Name:
Amyloid-beta precursor protein
Synonyms:
A4 ABPP AICD-50 AICD-59 AID(57) APP Alzheimer disease amyloid protein Amyloid beta Protein Amyloid beta protein Abeta(1-42) Amyloid intracellular domain 57 Amyloid protein (Abeta42b) Beta amyloid A4 protein Beta-APP42 Beta-amyloid protein 42 C83 CVAP Gamma Secretase Gamma-CTF(57) Gamma-secretase Gamma-secretase C-terminal fragment 57 P3(40) PN-II Protease nexin-II S-APP-beta Soluble APP-beta | beta-Amyloid Precursor Protein (APP)
Type:
Single-pass type I membrane protein
Mol. Mass.:
86890.41
Organism:
Homo sapiens (Human)
Description:
P05067
Residue:
770
  
Inhibitor
Name:
BDBM186067
Synonyms:
US9163011, 21
Type:
Small organic molecule
Emp. Form.:
C20H17ClF3N5O3
Mol. Mass.:
467.829
SMILES:
COCC#Cc1cnc(C(=O)Nc2ccc(F)c(n2)[C@@]2(C)N=C(N)OCC2(F)F)c(Cl)c1
: