Target
Stearoyl-CoA desaturase
Ligand
BDBM186596
Substrate
Meas. Tech.
Enzyme Activity Assay
pH
7.5±n/a
IC50
1±n/a nM
Comments
extracted
Citation
 Lachance, NLeclerc, JLi, CSMoradei, OM Spiro compounds useful as inhibitors of stearoyl-coenzyme A delta-9 desaturase US Patent  US9168248 Publication Date 10/27/2015 
Target
Name:
Stearoyl-CoA desaturase
Synonyms:
Acyl-CoA desaturase SCD SCDOS Stearoyl-CoA (SCD1) | Stearoyl-CoA desaturase 1
Type:
Enzyme
Mol. Mass.:
41537.27
Organism:
Homo sapiens (Human)
Description:
O00767
Residue:
359
  
Inhibitor
Name:
BDBM186596
Synonyms:
US9168248, 28
Type:
Small organic molecule
Emp. Form.:
C19H19BrN6O3S
Mol. Mass.:
491.362
SMILES:
OC(=O)Cn1nnc(n1)-c1cnc(s1)N1CCC2(CC1)CCc1c(Br)cccc1O2
: