Target
5-hydroxytryptamine receptor 2B
Ligand
BDBM186963
Substrate
Meas. Tech.
Radioligand Binding Assay
pH
7.4±n/a
Ki
333±n/a nM
Comments
extracted
Citation
 Besnard, JHopkins, ALGilbert, IRuda, GFAbecassis, K Morpholino compounds, uses and methods US Patent  US9079895 Publication Date 7/14/2015 
Target
Name:
5-hydroxytryptamine receptor 2B
Synonyms:
5-HT2 5-hydroxytryptamine receptor 2B 5HT2B_MOUSE Htr2b
Type:
Enzyme
Mol. Mass.:
53610.91
Organism:
Mus musculus (Mouse)
Description:
Q02152
Residue:
479
  
Inhibitor
Name:
BDBM186963
Synonyms:
US9079895, 65
Type:
Small organic molecule
Emp. Form.:
C22H25ClN2O3
Mol. Mass.:
400.899
SMILES:
CC1Cc2ccccc2N1C(=O)CN1CCO[C@@H](COc2cccc(Cl)c2)C1
: