Target
5-hydroxytryptamine receptor 2B
Ligand
BDBM186968
Substrate
Meas. Tech.
Radioligand Binding Assay
pH
7.4±n/a
Ki
3463±n/a nM
Comments
extracted
Citation
 Besnard, JHopkins, ALGilbert, IRuda, GFAbecassis, K Morpholino compounds, uses and methods US Patent  US9079895 Publication Date 7/14/2015 
Target
Name:
5-hydroxytryptamine receptor 2B
Synonyms:
5-HT2 5-hydroxytryptamine receptor 2B 5HT2B_MOUSE Htr2b
Type:
Enzyme
Mol. Mass.:
53610.91
Organism:
Mus musculus (Mouse)
Description:
Q02152
Residue:
479
  
Inhibitor
Name:
BDBM186968
Synonyms:
US9079895, 70
Type:
Small organic molecule
Emp. Form.:
C22H27N3O3
Mol. Mass.:
381.4681
SMILES:
CC1Cc2ccccc2N1C(=O)CN1CCO[C@@H](COc2cc(C)ccn2)C1
: