Target
Interleukin-1 receptor-associated kinase 4
Ligand
BDBM187792
Substrate
Meas. Tech.
Inhibition Assay
pH
7.2±n/a
IC50
10±n/a nM
Citation
 Santella, JBKumar, SRDuncia, JVGardner, DSPaidi, VRNair, SKHynes, JWu, HMurugesan, NSarkunam, KArunachalam, P Heteroaryl substituted nicotinamide compounds US Patent  US9169252 Publication Date 10/27/2015 
Target
Name:
Interleukin-1 receptor-associated kinase 4
Synonyms:
IRAK-4 IRAK4_HUMAN Interleukin-1 receptor-associated kinase 4 (IRAK4) | Renal carcinoma antigen NY-REN-64
Type:
Protein
Mol. Mass.:
51519.08
Organism:
Homo sapiens (Human)
Description:
Q9NWZ3
Residue:
460
  
Inhibitor
Name:
BDBM187792
Synonyms:
US9169252, 340
Type:
Small organic molecule
Emp. Form.:
C20H22ClFN6O3
Mol. Mass.:
448.878
SMILES:
CC(C)(O)[C@H](F)CNC(=O)c1cnc(cc1NC1COC1)-n1cnc2cc(Cl)cnc12
: