Target
Interleukin-1 receptor-associated kinase 4
Ligand
BDBM188060
Substrate
Meas. Tech.
Inhibition Assay
pH
7.2±n/a
IC50
18.2±n/a nM
Citation
 Santella, JBKumar, SRDuncia, JVGardner, DSPaidi, VRNair, SKHynes, JWu, HMurugesan, NSarkunam, KArunachalam, P Heteroaryl substituted nicotinamide compounds US Patent  US9169252 Publication Date 10/27/2015 
Target
Name:
Interleukin-1 receptor-associated kinase 4
Synonyms:
IRAK-4 IRAK4_HUMAN Interleukin-1 receptor-associated kinase 4 (IRAK4) | Renal carcinoma antigen NY-REN-64
Type:
Protein
Mol. Mass.:
51519.08
Organism:
Homo sapiens (Human)
Description:
Q9NWZ3
Residue:
460
  
Inhibitor
Name:
BDBM188060
Synonyms:
US9169252, 594 | US9169252, 596
Type:
Small organic molecule
Emp. Form.:
C22H28ClFN6O3
Mol. Mass.:
478.948
SMILES:
CC(C)C(O)CNc1cc(ncc1C(=O)NC[C@@H](F)C(C)(C)O)-n1ncc2cc(Cl)cnc12
: