Target
Gag-Pol polyprotein [A1275T]
Ligand
BDBM50011132
Substrate
Meas. Tech.
Strand Trasnfer Assay
IC50
4.61e+3± 4.5e+2 nM
Citation
 Feng, LSharma, ASlaughter, AJena, NKoh, YShkriabai, NLarue, RCPatel, PAMitsuya, HKessl, JJEngelman, AFuchs, JRKvaratskhelia, M The A128T resistance mutation reveals aberrant protein multimerization as the primary mechanism of action of allosteric HIV-1 integrase inhibitors. J Biol Chem 288:15813-20 (2013)  
Target
Name:
Gag-Pol polyprotein [A1275T]
Synonyms:
HIV-1 integrase (IN) A128T gag-pol
Type:
Protein
Mol. Mass.:
161850.08
Organism:
Human immunodeficiency virus 1 (Virus)
Description:
P12497[A1275T]
Residue:
1435
  
Inhibitor
Name:
BDBM50011132
Synonyms:
ALLINI-1 | CHEMBL3259891
Type:
Small organic molecule
Emp. Form.:
C19H15BrClNO3
Mol. Mass.:
420.684
SMILES:
COC(C(O)=O)c1c(C)nc2ccc(Br)cc2c1-c1ccc(Cl)cc1
: