Target
Methionine aminopeptidase 2
Ligand
BDBM188728
Substrate
Meas. Tech.
Enzymatic Screening Assay
IC50
6±n/a nM
Citation
 Benazet, ADuclos, OGuillo, NLassalle, GMacary, KVin, V Pyrazoloquinolinone derivatives, preparation thereof and therapeutic use thereof US Patent  US9169246 Publication Date 10/27/2015 
Target
Name:
Methionine aminopeptidase 2
Synonyms:
Initiation factor 2-associated 67 kDa glycoprotein MAP2_HUMAN MNPEP Methionine aminopeptidase 2 (MetAP2) P67EIF2 p67
Type:
Enzyme
Mol. Mass.:
52884.45
Organism:
Homo sapiens (Human)
Description:
P50579
Residue:
478
  
Inhibitor
Name:
BDBM188728
Synonyms:
US9169246, 270
Type:
Small organic molecule
Emp. Form.:
C23H23F3N6O
Mol. Mass.:
456.4635
SMILES:
CN1CCCN(CC1)c1ncccc1-c1ccc2c3[nH]ncc3c(=O)n(CC(F)(F)F)c2c1
: