Target
Receptor-interacting serine/threonine-protein kinase 1
Ligand
BDBM288686
Substrate
Meas. Tech.
Kinase Assay of RIPK1
Temperature
298.15±n/a K
Ki
22.5±n/a nM
Comments
extracted
Citation
 Zhang, ZWang, XSu, YRuan, HRen, Y Necrosis inhibitors US Patent  US10092529 Publication Date 10/9/2018 
Target
Name:
Receptor-interacting serine/threonine-protein kinase 1
Synonyms:
Cell death protein RIP RIP-1 RIPK1 Receptor-interacting protein 1
Type:
Enzyme Catalytic Domain
Mol. Mass.:
75926.99
Organism:
Homo sapiens (Human)
Description:
Q13546
Residue:
671
  
Inhibitor
Name:
BDBM288686
Synonyms:
TC001124 | US10092529, Compound 10
Type:
Small organic molecule
Emp. Form.:
C16H20F3NO
Mol. Mass.:
299.3313
SMILES:
CCC(C)(C)C(=O)N1CCCC1c1cc(F)cc(F)c1F
: