Target
Metabotropic glutamate receptor 4
Ligand
BDBM190447
Substrate
Meas. Tech.
Glutamate Receptor Activity
EC50
448±n/a nM
Citation
 Conn, PJLindsley, CWHopkins, CRNiswender, CMGogliotti, RD mGluR4 allosteric potentiators, compositions, and methods of treating neurological dysfunction US Patent  US9180192 Publication Date 11/10/2015 
Target
Name:
Metabotropic glutamate receptor 4
Synonyms:
GPRC1D GRM4_HUMAN MGLUR4 Metabotropic glutamate receptor 4 (mGlu4) metabotropic glutamate 4
Type:
Protein
Mol. Mass.:
101899.95
Organism:
Homo sapiens (Human)
Description:
Q14833
Residue:
912
  
Inhibitor
Name:
BDBM190447
Synonyms:
US9180192, 42
Type:
Small organic molecule
Emp. Form.:
C14H10ClN5O3S
Mol. Mass.:
363.779
SMILES:
Clc1cccc(n1)S(=O)(=O)n1cc(NC(=O)c2ccccn2)cn1
: