Target
Peroxisome proliferator-activated receptor alpha [169-468]
Ligand
BDBM190456
Substrate
Meas. Tech.
Reporter Gene Assay
EC50
1400±n/a nM
Citation
 Broo, AGottfries, JKossenjans, MLanna, LLindstedt-Alstermark, ENilsson, KAOhlsson, BThorstensson, MBoije, M 2-substituted-3-phenylpropionic acid derivatives and their use in the treatment of inflammatory bowel disease US Patent  US9181181 Publication Date 11/10/2015 
Target
Name:
Peroxisome proliferator-activated receptor alpha [169-468]
Synonyms:
NR1C1 PPARA Peroxisome proliferator-activated receptor alpha (PPAR alpha)
Type:
Enzyme
Mol. Mass.:
33974.77
Organism:
Homo sapiens (Human)
Description:
Q07869: amino acid 168-468
Residue:
300
  
Inhibitor
Name:
BDBM190456
Synonyms:
US9181181, 4
Type:
Small organic molecule
Emp. Form.:
C28H29FO6S2
Mol. Mass.:
544.655
SMILES:
CS(=O)(=O)Cc1ccc(COC(=O)Cc2ccc(CC(SCCc3ccc(F)cc3)C(O)=O)cc2)cc1
: