Target
Transient receptor potential cation channel subfamily V member 3
Ligand
BDBM190591
Substrate
Meas. Tech.
Inhibition Assay
IC50
<500±n/a nM
Citation
 Moran, MMChong, JAFanger, CRipka, ASLarsen, GRZhen, XUnderwood, DJWeigele, M Compounds of modulating TRPV3 function US Patent  US9181219 Publication Date 11/10/2015 
Target
Name:
Transient receptor potential cation channel subfamily V member 3
Synonyms:
TRPV3 Transient receptor potential cation channel subfamily V member 3 (TRPV3) | Vanilloid receptor-like 3
Type:
Enzyme
Mol. Mass.:
90635.51
Organism:
Homo sapiens (Human)
Description:
Q8NET8
Residue:
790
  
Inhibitor
Name:
BDBM190591
Synonyms:
US9181219, 2-[(3-chloropyridin-2-yl)sulfanyl]-1-(8-methoxy-1,2,3,4-tetrahydroquinolin-1-yl)ethan-1-one
Type:
Small organic molecule
Emp. Form.:
C17H17ClN2O2S
Mol. Mass.:
348.847
SMILES:
COc1cccc2CCCN(C(=O)CSc3ncccc3Cl)c12
: