Target
Beta-secretase 2
Ligand
BDBM190727
Substrate
Meas. Tech.
HTRF FRET Assay
pH
5±n/a
Temperature
303.15±n/a K
Ki
1.2±n/a nM
Comments
extracted
Citation
 Wu, WBurnett, DAStamford, AWCumming, JNAsberom, TBennett, CSasiskumar, TKScott, JD 2-spiro-substituted iminothiazines and their mono-and dioxides as bace inhibitors, compositions and their use US Patent  US9181236 Publication Date 11/10/2015 
Target
Name:
Beta-secretase 2
Synonyms:
AEPLC ASP1 Asp 1 Aspartyl protease 1 BACE2_HUMAN Beta-secretase (BACE) Beta-secretase 2 (BACE-2) Beta-site APP-cleaving enzyme 2 Memapsin-1 beta-Secretase (BACE-2)
Type:
Protein
Mol. Mass.:
56171.20
Organism:
Homo sapiens (Human)
Description:
Q9Y5Z0
Residue:
518
  
Inhibitor
Name:
BDBM190727
Synonyms:
US9181236, 31
Type:
Small organic molecule
Emp. Form.:
C21H21Cl2FN4O4S
Mol. Mass.:
515.385
SMILES:
C[C@]1(CS(=O)(=O)C2(CCOCC2)C(=N)N1)c1cc(NC(=O)c2ncc(Cl)cc2Cl)ccc1F
: