Target
High affinity nerve growth factor receptor
Ligand
BDBM191135
Substrate
Meas. Tech.
Kinase Activity Assay
Temperature
298.15±n/a K
EC50
19.7±n/a nM
Comments
extracted
Citation
 Stachel, SJEgbertson, MBrnardic, EJones, KGSanders, JMHenze, D TrkA kinase inhibitors, compositions and methods thereof US Patent  US9181261 Publication Date 11/10/2015 
Target
Name:
High affinity nerve growth factor receptor
Synonyms:
2.7.10.1 NTRK1 NTRK1_HUMAN Neurotrophic tyrosine kinase receptor type 1 Synonyms=MTC TRK1-transforming tyrosine kinase protein TRKA GN Trk-A Tropomyosin-related kinase A Tyrosine kinase receptor Tyrosine kinase receptor A Tyrosine kinase receptor A (Trk-A) gp140trk | p140-TrkA
Type:
Mol. Mass.:
87498.18
Organism:
Homo sapiens (Human)
Description:
P04629
Residue:
796
  
Inhibitor
Name:
BDBM191135
Synonyms:
US9181261, 5
Type:
Small organic molecule
Emp. Form.:
C21H21F3N4OS
Mol. Mass.:
434.478
SMILES:
CC1(C)CCN(C(=O)N1Cc1c[nH]c2ncccc12)c1ccc(SC(F)(F)F)cc1
: