Target
High affinity nerve growth factor receptor
Ligand
BDBM191137
Substrate
Meas. Tech.
Kinase Activity Assay
Temperature
298.15±n/a K
EC50
48±n/a nM
Comments
extracted
Citation
 Stachel, SJEgbertson, MBrnardic, EJones, KGSanders, JMHenze, D TrkA kinase inhibitors, compositions and methods thereof US Patent  US9181261 Publication Date 11/10/2015 
Target
Name:
High affinity nerve growth factor receptor
Synonyms:
2.7.10.1 NTRK1 NTRK1_HUMAN Neurotrophic tyrosine kinase receptor type 1 Synonyms=MTC TRK1-transforming tyrosine kinase protein TRKA GN Trk-A Tropomyosin-related kinase A Tyrosine kinase receptor Tyrosine kinase receptor A Tyrosine kinase receptor A (Trk-A) gp140trk | p140-TrkA
Type:
Mol. Mass.:
87498.18
Organism:
Homo sapiens (Human)
Description:
P04629
Residue:
796
  
Inhibitor
Name:
BDBM191137
Synonyms:
US9181261, 10
Type:
Small organic molecule
Emp. Form.:
C22H18F3N3O2S
Mol. Mass.:
445.457
SMILES:
CC(C#C)N(Cc1cccc(c1)-c1nccs1)C(=O)Nc1ccc(OC(F)(F)F)cc1
: