Target
Poly [ADP-ribose] polymerase tankyrase-2
Ligand
BDBM191141
Substrate
Meas. Tech.
Biochemical Assay
Temperature
298.15±n/a K
IC50
7±n/a nM
Comments
extracted
Citation
 Cheung, AKChin, DNFan, JMiller-Moslin, KMShultz, MDSmith, TDTomlinson, RCToure, BVisser, MSChen, Z 2-piperidin-1-yl-acetamide compounds for use as tankyrase inhibitors US Patent  US9181266 Publication Date 11/10/2015 
Target
Name:
Poly [ADP-ribose] polymerase tankyrase-2
Synonyms:
(ARTD6 or PARP5b) Poly [ADP-ribose] polymerase tankyrase-2 TNKL TNKS2_HUMAN Tankyrase 2 Tankyrase-2 Tankyrase-2 (TNKS2)
Type:
Enzyme
Mol. Mass.:
126937.16
Organism:
Homo sapiens (Human)
Description:
Q9H2K2
Residue:
1166
  
Inhibitor
Name:
BDBM191141
Synonyms:
US9181266, 2
Type:
Small organic molecule
Emp. Form.:
C22H25ClN4O4
Mol. Mass.:
444.911
SMILES:
Clc1ccc(cc1)C(=O)C1CCN(CC(=O)NCc2nc3CCOCc3c(=O)[nH]2)CC1
: