Target
Poly [ADP-ribose] polymerase tankyrase-2
Ligand
BDBM191181
Substrate
Meas. Tech.
Biochemical Assay
Temperature
298.15±n/a K
IC50
12±1 nM
Comments
extracted
Citation
 Cheung, AKChin, DNFan, JMiller-Moslin, KMShultz, MDSmith, TDTomlinson, RCToure, BVisser, MSChen, Z 2-piperidin-1-yl-acetamide compounds for use as tankyrase inhibitors US Patent  US9181266 Publication Date 11/10/2015 
Target
Name:
Poly [ADP-ribose] polymerase tankyrase-2
Synonyms:
(ARTD6 or PARP5b) Poly [ADP-ribose] polymerase tankyrase-2 TNKL TNKS2_HUMAN Tankyrase 2 Tankyrase-2 Tankyrase-2 (TNKS2)
Type:
Enzyme
Mol. Mass.:
126937.16
Organism:
Homo sapiens (Human)
Description:
Q9H2K2
Residue:
1166
  
Inhibitor
Name:
BDBM191181
Synonyms:
US9181266, 50
Type:
Small organic molecule
Emp. Form.:
C25H30F2N4O5
Mol. Mass.:
504.5263
SMILES:
COc1ccc(cc1)C(=O)C1CCN(CC(=O)N(CC(F)F)Cc2nc3CCOCc3c(=O)[nH]2)CC1
: