Target
Poly [ADP-ribose] polymerase tankyrase-2
Ligand
BDBM191196
Substrate
Meas. Tech.
Biochemical Assay
Temperature
298.15±n/a K
IC50
760±15 nM
Comments
extracted
Citation
 Cheung, AKChin, DNFan, JMiller-Moslin, KMShultz, MDSmith, TDTomlinson, RCToure, BVisser, MSChen, Z 2-piperidin-1-yl-acetamide compounds for use as tankyrase inhibitors US Patent  US9181266 Publication Date 11/10/2015 
Target
Name:
Poly [ADP-ribose] polymerase tankyrase-2
Synonyms:
(ARTD6 or PARP5b) Poly [ADP-ribose] polymerase tankyrase-2 TNKL TNKS2_HUMAN Tankyrase 2 Tankyrase-2 Tankyrase-2 (TNKS2)
Type:
Enzyme
Mol. Mass.:
126937.16
Organism:
Homo sapiens (Human)
Description:
Q9H2K2
Residue:
1166
  
Inhibitor
Name:
BDBM191196
Synonyms:
US9181266, 65
Type:
Small organic molecule
Emp. Form.:
C24H28N4O4
Mol. Mass.:
436.5035
SMILES:
O=C(CN1CCC2(CC1)CCc1ccccc1C2=O)NCc1nc2CCOCc2c(=O)[nH]1
: