Target
Poly [ADP-ribose] polymerase tankyrase-2
Ligand
BDBM191199
Substrate
Meas. Tech.
Biochemical Assay
Temperature
298.15±n/a K
IC50
5±1 nM
Comments
extracted
Citation
 Cheung, AKChin, DNFan, JMiller-Moslin, KMShultz, MDSmith, TDTomlinson, RCToure, BVisser, MSChen, Z 2-piperidin-1-yl-acetamide compounds for use as tankyrase inhibitors US Patent  US9181266 Publication Date 11/10/2015 
Target
Name:
Poly [ADP-ribose] polymerase tankyrase-2
Synonyms:
(ARTD6 or PARP5b) Poly [ADP-ribose] polymerase tankyrase-2 TNKL TNKS2_HUMAN Tankyrase 2 Tankyrase-2 Tankyrase-2 (TNKS2)
Type:
Enzyme
Mol. Mass.:
126937.16
Organism:
Homo sapiens (Human)
Description:
Q9H2K2
Residue:
1166
  
Inhibitor
Name:
BDBM191199
Synonyms:
US9181266, 68
Type:
Small organic molecule
Emp. Form.:
C24H28F2N4O4
Mol. Mass.:
474.5003
SMILES:
FC(F)CN(Cc1nc2CCOCc2c(=O)[nH]1)C(=O)CN1CCC(CC1)C(=O)c1ccccc1
: