Target
Poly [ADP-ribose] polymerase 2
Ligand
BDBM191147
Substrate
Meas. Tech.
Biochemical Assay
Temperature
298.15±n/a K
IC50
243±66 nM
Comments
extracted
Citation
 Cheung, AKChin, DNFan, JMiller-Moslin, KMShultz, MDSmith, TDTomlinson, RCToure, BVisser, MSChen, Z 2-piperidin-1-yl-acetamide compounds for use as tankyrase inhibitors US Patent  US9181266 Publication Date 11/10/2015 
Target
Name:
Poly [ADP-ribose] polymerase 2
Synonyms:
(ARTD2 or PARP2) ADPRTL2 PARP2_HUMAN Poly [ADP-ribose] polymerase 2 (PARP2)
Type:
Enzyme
Mol. Mass.:
66225.70
Organism:
Homo sapiens (Human)
Description:
Q9UGN5
Residue:
583
  
Inhibitor
Name:
BDBM191147
Synonyms:
US9181266, 9
Type:
Small organic molecule
Emp. Form.:
C24H30N4O4
Mol. Mass.:
438.5194
SMILES:
COc1ccc(cc1)C(=O)C1CCN(CC(=O)NCc2nc3CCCCc3c(=O)[nH]2)CC1
: