Target
Casein kinase I isoform epsilon
Ligand
BDBM191590
Substrate
Meas. Tech.
KinaseGlo Plus Luminescent Assay
pH
7.5±n/a
IC50
6.0e+3± 1.5e+3 nM
Comments
extracted
Citation
 Ursu, AIllich, DJTakemoto, YPorfetye, ATZhang, MBrockmeyer, AJanning, PWatanabe, NOsada, HVetter, IRZiegler, SSchler, HRWaldmann, H Epiblastin A Induces Reprogramming of Epiblast Stem Cells Into Embryonic Stem Cells by Inhibition of Casein Kinase 1. Cell Chem Biol 23:494-507 (2016)  
Target
Name:
Casein kinase I isoform epsilon
Synonyms:
Axin-1/Casein kinase I epsilon CKIe Casein kinase 1 epsilon (CK1Ɛ) Casein kinase I isoform epsilon (CK1 epsilon) Casein kinase I isoform epsilon (CK1epsilon) | KC1E_HUMAN
Type:
Protein
Mol. Mass.:
47340.25
Organism:
Homo sapiens (Human)
Description:
P49674
Residue:
416
  
Inhibitor
Name:
BDBM191590
Synonyms:
6-phenylpteridine-2,4-diamine (35)
Type:
Small organic molecule
Emp. Form.:
C12H10N6
Mol. Mass.:
238.248
SMILES:
Nc1nc(N)c2nc(cnc2n1)-c1ccccc1
: