Target
Lysine-specific demethylase 5C
Ligand
BDBM191597
Substrate
Meas. Tech.
AlphaLISA Assay
pH
7.2±n/a
Temperature
298.15±n/a K
IC50
1.8e+2± 1e+1 nM
Comments
extracted
Citation
 Horton, JRLiu, XGale, MWu, LShanks, JRZhang, XWebber, PJBell, JSKales, SCMott, BTRai, GJansen, DJHenderson, MJUrban, DJHall, MDSimeonov, AMaloney, DJJohns, MAFu, HJadhav, AVertino, PMYan, QCheng, X Structural Basis for KDM5A Histone Lysine Demethylase Inhibition by Diverse Compounds. Cell Chem Biol 23:769-81 (2016)  
Target
Name:
Lysine-specific demethylase 5C
Synonyms:
DXS1272E JARID1C KDM5C Lysine-specific demethylase 5C (KDM5C) Protein SmcX SMCX | XE169
Type:
PROTEIN
Mol. Mass.:
175691.17
Organism:
Homo sapiens (Human)
Description:
P41229
Residue:
1560
  
Inhibitor
Name:
BDBM191597
Synonyms:
3-((1-(2-(4,4-difluoropiperidin-1-yl)ethyl)-5-fluoro-1H-indazol-3-yl)amino)-isonicotinic acid (N11) US10336727, Example 73 | US9617242, Example 73
Type:
Small organic molecule
Emp. Form.:
C20H20F3N5O2
Mol. Mass.:
419.4003
SMILES:
OC(=O)c1ccncc1Nc1nn(CCN2CCC(F)(F)CC2)c2ccc(F)cc12
: