Target
Tyrosine-protein kinase Lyn
Ligand
BDBM50357312
Substrate
Meas. Tech.
HotSpot kinase assay
IC50
16.2±n/a nM
Citation
 Honigberg, LVerner, EBuggy, JJLoury, DChen, W Inhibitors of bruton's tyrosine kinase US Patent  US9181263 Publication Date 11/10/2015 
Target
Name:
Tyrosine-protein kinase Lyn
Synonyms:
JTK8 LYN_HUMAN Tyrosine-protein kinase Lyn (LYN) p53Lyn | p56Lyn
Type:
Protein
Mol. Mass.:
58575.92
Organism:
Homo sapiens (Human)
Description:
P07948
Residue:
512
  
Inhibitor
Name:
BDBM50357312
Synonyms:
IBRUTINIB US10124003, Ref. Ex. Compound 1 US10793575, Example ibrutinib US10919899, Ibrutinib US11186578, Example Ibrutinib US11407754, Example Ibrutinib US9108973, Ref 1 US9278100, 1
Type:
Small organic molecule
Emp. Form.:
C25H24N6O2
Mol. Mass.:
440.4971
SMILES:
Nc1ncnc2n(nc(-c3ccc(Oc4ccccc4)cc3)c12)[C@@H]1CCCN(C1)C(=O)C=C
: