Target
Prothrombin
Ligand
BDBM50041802
Substrate
Meas. Tech.
High-Throughput Screening Assay
IC50
>20000±n/a nM
Citation
 Vasioukhin, VIChevillet, JR Hepsin inhibitors US Patent  US9182402 Publication Date 11/10/2015 
Target
Name:
Prothrombin
Synonyms:
Activation peptide fragment 1 Coagulation factor II Prothrombin Thrombin Thrombin light chain
Type:
Enzyme
Mol. Mass.:
70502.73
Organism:
Bos taurus (Bovine)
Description:
P00735
Residue:
625
  
Inhibitor
Name:
BDBM50041802
Synonyms:
1,8-dihydroxy-9(10H)-anthracenone 1,8-dihydroxyanthracen-9(10H)-one CHEMBL46469 anthralin dithranol
Type:
Small organic molecule
Emp. Form.:
C14H10O3
Mol. Mass.:
226.2274
SMILES:
Oc1cccc2Cc3cccc(O)c3C(=O)c12
: