Target
Transient receptor potential cation channel subfamily A member 1
Ligand
BDBM191653
Substrate
Meas. Tech.
Radiometric Calcium Assay
Temperature
298.15±n/a K
IC50
1.45±n/a nM
Comments
extracted
Citation
 Khairatkar-Joshi, NKulkarni, AMukhopadhyay, IKattige, VGBhosale, VMWale, DPThomas, AKumar, SChaudhari, SS Treatment of respiratory disorders using TRPA1 antagonists US Patent  US9186360 Publication Date 11/17/2015 
Target
Name:
Transient receptor potential cation channel subfamily A member 1
Synonyms:
ANKTM1 TRPA1 Transformation-sensitive protein p120 | Transient receptor potential cation channel subfamily A member 1 (TRPA1)
Type:
Protein
Mol. Mass.:
127514.20
Organism:
Homo sapiens (Human)
Description:
O75762
Residue:
1119
  
Inhibitor
Name:
BDBM191653
Synonyms:
US9186360, 57
Type:
Small organic molecule
Emp. Form.:
C21H15Cl2F3N4O5S
Mol. Mass.:
563.334
SMILES:
Cn1c2occ(CC(=O)Nc3nc(cs3)-c3cc(Cl)c(OCC(F)(F)F)c(Cl)c3)c2c(=O)n(C)c1=O
: