Target
Transient receptor potential cation channel subfamily A member 1
Ligand
BDBM60874
Substrate
Meas. Tech.
Radiometric Calcium Assay
Temperature
298.15±n/a K
IC50
1.68±n/a nM
Comments
extracted
Citation
 Khairatkar-Joshi, NKulkarni, AMukhopadhyay, IKattige, VGBhosale, VMWale, DPThomas, AKumar, SChaudhari, SS Treatment of respiratory disorders using TRPA1 antagonists US Patent  US9186360 Publication Date 11/17/2015 
Target
Name:
Transient receptor potential cation channel subfamily A member 1
Synonyms:
ANKTM1 TRPA1 Transformation-sensitive protein p120 | Transient receptor potential cation channel subfamily A member 1 (TRPA1)
Type:
Protein
Mol. Mass.:
127514.20
Organism:
Homo sapiens (Human)
Description:
O75762
Residue:
1119
  
Inhibitor
Name:
BDBM60874
Synonyms:
US9186360, 62
Type:
Emp. Form.:
C22H17F5N4O5S
Mol. Mass.:
544.451
SMILES:
Cc1oc2n(C)c(=O)n(C)c(=O)c2c1CC(=O)Nc1nc(cs1)-c1cc(F)c(OCC(F)(F)F)c(F)c1
: