Target
Transient receptor potential cation channel subfamily A member 1
Ligand
BDBM191727
Substrate
Meas. Tech.
Radiometric Calcium Assay
Temperature
298.15±n/a K
IC50
10.57±n/a nM
Comments
extracted
Citation
 Khairatkar-Joshi, NKulkarni, AMukhopadhyay, IKattige, VGBhosale, VMWale, DPThomas, AKumar, SChaudhari, SS Treatment of respiratory disorders using TRPA1 antagonists US Patent  US9186360 Publication Date 11/17/2015 
Target
Name:
Transient receptor potential cation channel subfamily A member 1
Synonyms:
ANKTM1 TRPA1 Transformation-sensitive protein p120 | Transient receptor potential cation channel subfamily A member 1 (TRPA1)
Type:
Protein
Mol. Mass.:
127514.20
Organism:
Homo sapiens (Human)
Description:
O75762
Residue:
1119
  
Inhibitor
Name:
BDBM191727
Synonyms:
US9186360, 78
Type:
Small organic molecule
Emp. Form.:
C19H13F4N5O3S2
Mol. Mass.:
499.462
SMILES:
Cn1c2snc(CC(=O)Nc3nc(cs3)-c3ccc(cc3F)C(F)(F)F)c2c(=O)n(C)c1=O
: