Target
Adenosine receptor A2a
Ligand
BDBM191779
Substrate
Meas. Tech.
Luciferase Assay
pH
7.4±n/a
Temperature
310.15±n/a K
EC50
460±n/a nM
Comments
extracted
Citation
 Vakalopoulos, AMeibom, DNell, PSussmeier, FAlbrecht-Kupper, BZimmermann, KKeldenich, JSchneider, DKrenz, U Substituted dicyanopyridines and use thereof US Patent  US9187428 Publication Date 11/17/2015 
Target
Name:
Adenosine receptor A2a
Synonyms:
A2A adenosine receptor (hA2A) ADENOSINE A2 ADORA2 Adenosine A2A receptor (A2AAR)
Type:
G Protein-Coupled Receptor (GPCR)
Mol. Mass.:
44716.46
Organism:
Homo sapiens (Human)
Description:
P29274
Residue:
412
  
Inhibitor
Name:
BDBM191779
Synonyms:
US9187428, 7
Type:
Small organic molecule
Emp. Form.:
C25H24N6O3S
Mol. Mass.:
488.561
SMILES:
CNC(=O)c1cc(CSc2nc(N)c(C#N)c(-c3ccc(OCC(C)(C)O)cc3)c2C#N)ccn1
: