Target
Adenosine receptor A2a
Ligand
BDBM191832
Substrate
Meas. Tech.
Luciferase Assay
pH
7.4±n/a
Temperature
310.15±n/a K
EC50
3000±n/a nM
Comments
extracted
Citation
 Vakalopoulos, AMeibom, DNell, PSussmeier, FAlbrecht-Kupper, BZimmermann, KKeldenich, JSchneider, DKrenz, U Substituted dicyanopyridines and use thereof US Patent  US9187428 Publication Date 11/17/2015 
Target
Name:
Adenosine receptor A2a
Synonyms:
A2A adenosine receptor (hA2A) ADENOSINE A2 ADORA2 Adenosine A2A receptor (A2AAR)
Type:
G Protein-Coupled Receptor (GPCR)
Mol. Mass.:
44716.46
Organism:
Homo sapiens (Human)
Description:
P29274
Residue:
412
  
Inhibitor
Name:
BDBM191832
Synonyms:
US9187428, 60
Type:
Small organic molecule
Emp. Form.:
C24H21N5O3S
Mol. Mass.:
459.52
SMILES:
CC(Sc1nc(N)c(C#N)c(-c2ccc(OCCO)cc2)c1C#N)c1cccc(c1)C(N)=O
: