Target
Adenosine receptor A2b
Ligand
BDBM191840
Substrate
Meas. Tech.
Luciferase Assay
pH
7.4±n/a
Temperature
310.15±n/a K
EC50
440±n/a nM
Comments
extracted
Citation
 Vakalopoulos, AMeibom, DNell, PSussmeier, FAlbrecht-Kupper, BZimmermann, KKeldenich, JSchneider, DKrenz, U Substituted dicyanopyridines and use thereof US Patent  US9187428 Publication Date 11/17/2015 
Target
Name:
Adenosine receptor A2b
Synonyms:
AA2BR_HUMAN ADORA2B Adenosine receptors A2b | Adenosine receptors; A2a & A2b
Type:
G Protein-Coupled Receptor (GPCR)
Mol. Mass.:
36341.22
Organism:
Homo sapiens (Human)
Description:
Residue:
332
  
Inhibitor
Name:
BDBM191840
Synonyms:
US9187428, 68
Type:
Small organic molecule
Emp. Form.:
C23H18N6O2
Mol. Mass.:
410.428
SMILES:
Nc1nc(OCc2ccnc(c2)C(=O)NC2CC2)c(C#N)c(-c2ccccc2)c1C#N
: