Target
Adenosine receptor A2b
Ligand
BDBM191866
Substrate
Meas. Tech.
Luciferase Assay
pH
7.4±n/a
Temperature
310.15±n/a K
EC50
3000±n/a nM
Comments
extracted
Citation
 Vakalopoulos, AMeibom, DNell, PSussmeier, FAlbrecht-Kupper, BZimmermann, KKeldenich, JSchneider, DKrenz, U Substituted dicyanopyridines and use thereof US Patent  US9187428 Publication Date 11/17/2015 
Target
Name:
Adenosine receptor A2b
Synonyms:
AA2BR_HUMAN ADORA2B Adenosine receptors A2b | Adenosine receptors; A2a & A2b
Type:
G Protein-Coupled Receptor (GPCR)
Mol. Mass.:
36341.22
Organism:
Homo sapiens (Human)
Description:
Residue:
332
  
Inhibitor
Name:
BDBM191866
Synonyms:
US9187428, 94
Type:
Small organic molecule
Emp. Form.:
C28H27N5O4S
Mol. Mass.:
529.61
SMILES:
CNC(=O)c1cccc(CSc2nc(N3CC[C@@H](O)C3)c(C#N)c(-c3ccc(OCCO)cc3)c2C#N)c1
: