Target
Cytochrome P450 11B1, mitochondrial
Ligand
BDBM191917
Substrate
Meas. Tech.
Cellular Enzyme Assay
EC50
64±n/a nM
Citation
 Aebi, JAmrein, KHornsperger, BKuhn, BLiu, YMaerki, HPMartin, REMayweg, AVMohr, PTan, X Phenyl-tetrahydroisoquinoline derivatives US Patent  US9187429 Publication Date 11/17/2015 
Target
Name:
Cytochrome P450 11B1, mitochondrial
Synonyms:
C11B1_HUMAN CYPXIB1 Cytochrome P450 11B1 Cytochrome P450 11B1, mitochondrial | S11BH
Type:
Enzyme
Mol. Mass.:
57591.44
Organism:
Homo sapiens (Human)
Description:
P15538
Residue:
503
  
Inhibitor
Name:
BDBM191917
Synonyms:
US9187429, 55
Type:
Small organic molecule
Emp. Form.:
C17H16ClFN2O
Mol. Mass.:
318.773
SMILES:
CCC(=O)NC1CCc2c1cncc2-c1ccc(Cl)c(F)c1
: