Target
Cytochrome P450 11B2, mitochondrial
Ligand
BDBM191927
Substrate
Meas. Tech.
Cellular Enzyme Assay
EC50
11±n/a nM
Citation
 Aebi, JAmrein, KHornsperger, BKuhn, BLiu, YMaerki, HPMartin, REMayweg, AVMohr, PTan, X Phenyl-tetrahydroisoquinoline derivatives US Patent  US9187429 Publication Date 11/17/2015 
Target
Name:
Cytochrome P450 11B2, mitochondrial
Synonyms:
Aldosterone Synthase (CYP11B2) Aldosterone-synthesizing enzyme CYP11B2 Cytochrome P450 11B2 Cytochrome P450 11B2, mitochondrial P-450C18 | Steroid 18-hydroxylase
Type:
Protein
Mol. Mass.:
57582.15
Organism:
Homo sapiens (Human)
Description:
P19099
Residue:
503
  
Inhibitor
Name:
BDBM191927
Synonyms:
US9187429, 69
Type:
Small organic molecule
Emp. Form.:
C20H21F3N2O
Mol. Mass.:
362.3887
SMILES:
CCC(=O)N[C@@H]1[C@@H](C)CCc2c1cncc2-c1ccc(cc1)C(F)(F)F
: