Target
Cytochrome P450 11B2, mitochondrial
Ligand
BDBM191943
Substrate
Meas. Tech.
Cellular Enzyme Assay
EC50
12.1±n/a nM
Citation
 Aebi, JAmrein, KHornsperger, BKuhn, BLiu, YMaerki, HPMartin, REMayweg, AVMohr, PTan, X Phenyl-tetrahydroisoquinoline derivatives US Patent  US9187429 Publication Date 11/17/2015 
Target
Name:
Cytochrome P450 11B2, mitochondrial
Synonyms:
Aldosterone Synthase (CYP11B2) Aldosterone-synthesizing enzyme CYP11B2 Cytochrome P450 11B2 Cytochrome P450 11B2, mitochondrial P-450C18 | Steroid 18-hydroxylase
Type:
Protein
Mol. Mass.:
57582.15
Organism:
Homo sapiens (Human)
Description:
P19099
Residue:
503
  
Inhibitor
Name:
BDBM191943
Synonyms:
US9187429, 87 | US9187429, 88
Type:
Small organic molecule
Emp. Form.:
C17H16N2O
Mol. Mass.:
264.3217
SMILES:
CC1(C)Cc2c(cncc2-c2ccc(cc2)C#N)C1O
: