Target
Cytochrome P450 11B2, mitochondrial
Ligand
BDBM191952
Substrate
Meas. Tech.
Cellular Enzyme Assay
EC50
1.4±n/a nM
Citation
 Aebi, JAmrein, KHornsperger, BKuhn, BLiu, YMaerki, HPMartin, REMayweg, AVMohr, PTan, X Phenyl-tetrahydroisoquinoline derivatives US Patent  US9187429 Publication Date 11/17/2015 
Target
Name:
Cytochrome P450 11B2, mitochondrial
Synonyms:
Aldosterone Synthase (CYP11B2) Aldosterone-synthesizing enzyme CYP11B2 Cytochrome P450 11B2 Cytochrome P450 11B2, mitochondrial P-450C18 | Steroid 18-hydroxylase
Type:
Protein
Mol. Mass.:
57582.15
Organism:
Homo sapiens (Human)
Description:
P19099
Residue:
503
  
Inhibitor
Name:
BDBM191952
Synonyms:
US9187429, 97
Type:
Small organic molecule
Emp. Form.:
C21H22F3NO3
Mol. Mass.:
393.3995
SMILES:
CC(C)(C)OC(=O)COC1CCc2c1cncc2-c1ccc(cc1)C(F)(F)F
: