Target
Cytochrome P450 11B2, mitochondrial
Ligand
BDBM191958
Substrate
Meas. Tech.
Cellular Enzyme Assay
EC50
0.2±n/a nM
Citation
 Aebi, JAmrein, KHornsperger, BKuhn, BLiu, YMaerki, HPMartin, REMayweg, AVMohr, PTan, X Phenyl-tetrahydroisoquinoline derivatives US Patent  US9187429 Publication Date 11/17/2015 
Target
Name:
Cytochrome P450 11B2, mitochondrial
Synonyms:
Aldosterone Synthase (CYP11B2) Aldosterone-synthesizing enzyme CYP11B2 Cytochrome P450 11B2 Cytochrome P450 11B2, mitochondrial P-450C18 | Steroid 18-hydroxylase
Type:
Protein
Mol. Mass.:
57582.15
Organism:
Homo sapiens (Human)
Description:
P19099
Residue:
503
  
Inhibitor
Name:
BDBM191958
Synonyms:
US9187429, 103
Type:
Small organic molecule
Emp. Form.:
C20H20F3NO2
Mol. Mass.:
363.3735
SMILES:
CC1(COC2CCc3c2cncc3-c2ccc(cc2)C(F)(F)F)COC1
: