Target
Vasopressin V1a receptor
Ligand
BDBM192450
Substrate
Meas. Tech.
Cellular In Vitro Assay
IC50
4±n/a nM
Citation
 Furstner, CKeldenich, JDelbeck, MKolkhof, PKretschmer, APluschkell, IPook, ESchmeck, CTrubel, H Bisaryl-bonded aryltriazolones and use thereof US Patent  US9187466 Publication Date 11/17/2015 
Target
Name:
Vasopressin V1a receptor
Synonyms:
AVPR V1a AVPR1A V1AR_HUMAN VASOPRESSIN V1A Vasopressin V1 receptor Vasopressin receptor
Type:
Receptor
Mol. Mass.:
46820.18
Organism:
Homo sapiens (Human)
Description:
P37288
Residue:
418
  
Inhibitor
Name:
BDBM192450
Synonyms:
US9187466, 42 | US9687476, 42
Type:
Small organic molecule
Emp. Form.:
C26H21Cl3N6O2
Mol. Mass.:
555.843
SMILES:
COc1ccc(Cn2c(nn(Cc3nnc(Cc4c(Cl)cccc4Cl)[nH]3)c2=O)-c2ccc(Cl)cc2)cc1
: