Target
Vasopressin V2 receptor
Ligand
BDBM192452
Substrate
Meas. Tech.
Cellular In Vitro Assay
IC50
1.4±n/a nM
Citation
 Furstner, CKeldenich, JDelbeck, MKolkhof, PKretschmer, APluschkell, IPook, ESchmeck, CTrubel, H Bisaryl-bonded aryltriazolones and use thereof US Patent  US9187466 Publication Date 11/17/2015 
Target
Name:
Vasopressin V2 receptor
Synonyms:
ADHR AVPR2 DIR Renal-type arginine vasopressin receptor V2R_HUMAN Vasopressin V2 receptor | Vasopressin receptor
Type:
Receptor
Mol. Mass.:
40295.28
Organism:
Homo sapiens (Human)
Description:
P30518
Residue:
371
  
Inhibitor
Name:
BDBM192452
Synonyms:
US9187466, 50 | US9687476, 50
Type:
Small organic molecule
Emp. Form.:
C21H17ClF4N6O2
Mol. Mass.:
496.845
SMILES:
O[C@@H](Cn1c(nn(Cc2nnc(Cc3ccccc3F)[nH]2)c1=O)-c1ccc(Cl)cc1)C(F)(F)F
: