Target
Seed linoleate 13S-lipoxygenase-1
Ligand
BDBM192763
Substrate
Meas. Tech.
Lipo-oxygenase Inhibitory Assay
pH
7±n/a
Temperature
298.15±n/a K
IC50
7.6e+3± 7e+2 nM
Comments
extracted
Citation
 Jabbari, ASadeghian, HSalimi, AMousavian, MSeyedi, SMBakavoli, M 2-Prenylated m-dimethoxybenzenes as potent inhibitors of 15-lipo-oxygenase: inhibitory mechanism and SAR studies. Chem Biol Drug Des 88:460-9 (2016)  
Target
Name:
Seed linoleate 13S-lipoxygenase-1
Synonyms:
15-LOX 15-lipo-oxygenase (SLO) L-1 LOX1.1 Lipoxygenase (LOX) Lipoxygenase-1 | Seed lipoxygenase-1
Type:
Enzyme
Mol. Mass.:
94365.66
Organism:
Glycine max (soybean)
Description:
Residue:
839
  
Inhibitor
Name:
BDBM192763
Synonyms:
1,3-Dimethoxy-5-methyl-2-(3-methylbut-2-en-1-yl)benzene (9)
Type:
Small organic molecule
Emp. Form.:
C14H20O2
Mol. Mass.:
220.3074
SMILES:
[#6]-[#8]-c1cc(-[#6])cc(-[#8]-[#6])c1-[#6]\[#6]=[#6](\[#6])-[#6]
: