Target
Beta-galactosidase
Ligand
BDBM192768
Substrate
Meas. Tech.
beta-Galactosidase Assay
Temperature
303.15±n/a K
Ki
3.9e+3± 2e+2 nM
Comments
extracted
Citation
 Van Dyke, AREtemad, LSVessicchio, MJNaclerio, GAJedson, V Capture-Tag-Release: A Strategy for Small Molecule Labeling of Native Enzymes. Chembiochem 17:1602-5 (2016)  
Target
Name:
Beta-galactosidase
Synonyms:
BGAL_ECOLI beta-Galactosidase (β-gal) | lacZ
Type:
Protein
Mol. Mass.:
116458.31
Organism:
Escherichia coli (Enterobacteria)
Description:
P00722
Residue:
1024
  
Inhibitor
Name:
BDBM192768
Synonyms:
β-gal inhibitor, 14
Type:
Small organic molecule
Emp. Form.:
C53H60N2O14S
Mol. Mass.:
981.114
SMILES:
OC[C@H]1O[C@@H](SCCOCCOC(=O)c2ccc(cc2C(c2ccccc2)c2ccccc2)C(=O)NCCOCCOCCOCCNC(=O)c2ccc(cc2)C(=O)c2ccccc2)[C@H](O)[C@@H](O)[C@H]1O
: