Target
Lysosomal Pro-X carboxypeptidase
Ligand
BDBM193272
Substrate
Meas. Tech.
Activation Assay
Ki
282900±n/a nM
Citation
 Shariat-Madar, ZRimoldi, JMGadepalli, RS Selective inhibitors of prolylcarboxypeptidase US Patent  US9193762 Publication Date 11/24/2015 
Target
Name:
Lysosomal Pro-X carboxypeptidase
Synonyms:
Angiotensinase C PCP PRCP Prolylcarboxypeptidase | Prolylcarboxypeptidase (PRCP)
Type:
Enzyme
Mol. Mass.:
55805.19
Organism:
Homo sapiens (Human)
Description:
P42785
Residue:
496
  
Inhibitor
Name:
BDBM193272
Synonyms:
US9193762, RS-33-17
Type:
Small organic molecule
Emp. Form.:
C26H30BrN3O4
Mol. Mass.:
528.438
SMILES:
Brc1ccc(CCNC(=O)[C@@H]2CCCN2C(=O)[C@@H]2CCCN2C(=O)OCc2ccccc2)cc1
: